{"text_format":"1","workbook":"xlsx","n_sheets":4,"sheets":["Base","Guidance","CD3","AM"],"not_rendered":{"charts":1,"images":7,"macros":1,"external_links":0,"defined_names":1,"comments":0,"pivot_tables":0},"unopened":[],"bounds":{"document_bytes":16777216,"sheet_cells":100000,"rows_first":2000,"rows_last":500,"rows_between":2000,"halvings":0,"cell_chars":16384,"cell_head_chars":4096},"cells_cut":0,"cells_raw":0,"read":"whole","date_system":"1900"}

{"sheet":"Base","index":0,"n_rows":44,"n_cols":55,"rows_kept":44,"cut":false,"hidden":false,"merged":[]}
[null,null,null,null,null,null,null,"Project / Site Name"]
[null,null,null,null,null,null,null,"PeakFlow Dataset Location","C:\\Users\\gfrisby\\AppData\\Local\\Wallingford_HydroSolutions\\WINFAP\\data\\NRFAPeakFlow_v10\\suitable-for-pooling"]
[]
[]
[null,null,null,null,null,null,null,null,null,null,null,null,null,null,null,null,null,null,null,null,null,null,null,null,null,null,null,null,null,null,null,null,null,null,null,null,null,null,null,null,null,null,null,null,null,null,null,"Need to add in warning that it is not in the list."]
[]
[]
[]
[]
[null,"Pooling Group",null,null,null,null,null,null,null,null,null,null,null,null,null,null,null,null,null,"UNGAUGED TARGET",null,null,null,null,null,null,null,null,null,null,null,null,null,null,null,"Return intervals for individual curves"]
[null,null,null,null,null,null,null,null,null,null,null,null,null,null,null,null,null,null,null,"L-CV",null,null,null,null,null,null,"L-SKEW",null,null,null,null,null,null,null,"yt",{"$f":"C41","v":2},5,10,20,25,50,100,200,500,1000,null,null,null,null,"Notes and Warnings"]
[null,"Station","Distance","Years of data","QMED AM","L-CV","L-SKEW","Station No ","L-CVAdj","L-SKEWadj","k (Shape)","Beta (Scale)","Warnings ",null,null,null,null,null,null,"bj","cj","(bj+cj)^-1","wj","t2*wj","Total weighting",null,"bj","cj","(bj+cj)^-1","wj","t3*wj","Total weighting",null,null,null,{"$f":"LN(AJ11-1)","v":0},{"$f":"LN(AK11-1)","v":1.3862943611198906},2.1972245773362196,2.9444389791664403,{"$f":"LN(AN11-1)","v":3.1780538303479458},3.8918202981106265,4.5951198501345898,5.2933048247244923,6.2126060957515188,6.9067547786485539,null,"SPRHOST","No yrs in record","No flood yrs > Qmed/2","Adjustment applied","Not present in NRFA Peak Flows list","Present","L-Skew","No non flood years","Many non flood years"]
[null,"27051 (Crimple @ Burn Bridge)",0.98799999999999999,48,4.5439999999999996,0.219,0.14599999999999999,{"$f":"IFERROR(VALUE(LEFT(B13,FIND(\"(\",B13)-1)),\"-\")","v":27051},{"$f":"IFERROR(IF(VLOOKUP(H13,INDIRECT(\"CD3!$A$2:$V$1048576\"),21,FALSE)=0,F13,VLOOKUP(H13,INDIRECT(\"CD3!$A$2:$V$1048576\"),21,FALSE)),\"-\")","v":0.219},{"$f":"IFERROR(IF(VLOOKUP(H13,INDIRECT(\"CD3!$A$2:$V$1048576\"),22,FALSE)=0,G13,VLOOKUP(H13,INDIRECT(\"CD3!$A$2:$V$1048576\"),22,FALSE)),\"-\")","v":0.14599999999999999},{"$f":"IFERROR(-1*J13,\"-\")","v":-0.14599999999999999},{"$f":"IFERROR((K13*I13*SIN(PI()*K13))/(K13*PI()*(I13+K13)-I13*SIN(PI()*K13)),\"-\")","v":0.22300784524907985},{"$f":"AX13&AZ13&BA13& BB13 & BC13","v":""},null,null,null,null,null,null,{"$f":"IF(C13=\"\",\"-\",(0.0047*(C13^0.5)+0.0023/2))","v":5.8217148885607306E-3},{"$f":"IF(D13=\"\",\"-\",0.02609/(D13-1))","v":5.5510638297872337E-4},{"$f":"IFERROR((U13+T13)^-1,\"-\")","v":156.81794383404227},{"$f":"IFERROR(V13/V$36,\"-\")","v":8.4732673066692604E-2},{"$f":"IFERROR(W13*I13,\"-\")","v":1.8556455401605679E-2},{"$f":"IFERROR(X13/X$37,\"-\")","v":6.9100360091511381E-2},null,{"$f":"IF(C13=\"\",\"-\",0.0219*(1-(EXP(C13/-0.236))))","v":2.1567113617576048E-2},{"$f":"IF(D13=\"\",\"-\",0.2743/(D13-2))","v":5.9630434782608696E-3},{"$f":"IFERROR((AB13+AA13)^-1,\"-\")","v":36.32380289436194},{"$f":"IFERROR(AC13/AC$36,\"-\")","v":7.5304619431632955E-2},{"$f":"IFERROR(AD13*J13,\"-\")","v":1.099447443701841E-2},{"$f":"IFERROR(AE13/AE$37,\"-\")","v":4.5401470367248793E-2},null,null,{"$f":"IF(B13=\"\",\"-\",B13)","v":"27051 (Crimple @ Burn Bridge)"},{"$f":"IFERROR(1+(($L13/$K13)*(1-((AJ$11-1)^(-1*$K13)))),\"-\")","v":1},1.3426628457542578,1.5777166767102735,1.8203717815389036,1.9018320944634723,2.1686484896381306,2.4602011040863152,2.780810535608464,3.2560161359383444,3.6595575477532538,null,{"$f":"IFERROR(INDEX('CD3'!B$2:B$100000,(MATCH(H13,'CD3'!A$2:A$100000,0))),\"-\")","v":40.770000000000003},{"$f":"IFERROR(IF(VLOOKUP(H13,INDIRECT(\"CD3!$A$2:$V$1048576\"),21,FALSE)=0,\"-\",VLOOKUP(H13,INDIRECT(\"CD3!$A$2:$V$1048576\"),5,FALSE)),\"-\")","v":"-"},{"$f":"IFERROR(IF(VLOOKUP(H13,INDIRECT(\"CD3!$A$2:$V$1048576\"),21,FALSE)=0,\"-\",VLOOKUP(H13,INDIRECT(\"CD3!$A$2:$V$1048576\"),6,FALSE)),\"-\")","v":"-"},{"$f":"IF(AU13<=20,\"SPRHOST <=20.\",\"\")","v":""},{"$f":"IF(H13<>\"-\",IFERROR(MATCH(H13,'CD3'!A:A,0),\"Not present in current NRFA dataset\"),\"\")","v":150},{"$f":"IF(AND(ISNUMBER(AY13),AY13<>\"\"),\"\",AY13)","v":""},{"$f":"IF(J13<0, \" Adjusted L-Skew is negative, consider removing station.\", \"\")","v":""},{"$f":"IF(AND(AV13=\"-\",AU13<=20),\" Zero non-flood yrs, permeable adjustment not applied.\",\"\")","v":""},{"$f":"IF(ISNUMBER(AV13),IF((AV13-AW13)/AV13>0.15,\" Non-Flood Yrs over 15% of record, consider removing station.\",\"\"),\"\")","v":""}]
[null,"26016 (Gypsey Race @ Kirby Grindalythe)",1.25,23,0.10100000000000001,0.312,0.25800000000000001,26016,0.2834180532130624,0.31346399782499029,-0.31346399782499029,0.27855877563423509,"SPRHOST <=20.",null,null,null,null,null,null,6.4047597471245058E-3,1.1859090909090908E-3,131.74069654961463,7.1182806618929978E-2,2.0174492474179028E-2,7.5125591847063092E-2,null,2.17903129022614E-2,1.3061904761904761E-2,28.692578751686305,5.9483962339837208E-2,1.8646080641516537E-2,7.699863077227026E-2,null,null,"26016 (Gypsey Race @ Kirby Grindalythe)",1,1.4836666236639757,1.8808502826435038,2.3478711831912129,2.517796936151532,3.1212028256379267,3.8635789899098647,4.7815679738652337,6.3413318875958229,7.8557031036491818,null,{"$f":"IFERROR(INDEX('CD3'!B$2:B$100000,(MATCH(H14,'CD3'!A$2:A$100000,0))),\"-\")","v":5.67},23,20,{"$f":"IF(AU14<=20,\"SPRHOST <=20.\",\"\")","v":"SPRHOST <=20."},{"$f":"IF(H14<>\"-\",IFERROR(MATCH(H14,'CD3'!A:A,0),\"Not present in current NRFA dataset\"),\"\")","v":126},{"$f":"IF(AND(ISNUMBER(AY14),AY14<>\"\"),\"\",AY14)","v":""},"","",""]
[null,"25019 (Leven @ Easby)",1.3129999999999999,42,5.3840000000000003,0.33800000000000002,0.38600000000000001,25019,0.33800000000000002,0.38600000000000001,-0.38600000000000001,0.32604698978299551,"",null,null,null,null,null,null,6.5355519679973374E-3,6.3634146341463415E-4,139.43319286091571,7.5339255549940129E-2,2.5464668375879764E-2,9.4825100823509409E-2,null,2.1816011272469672E-2,6.8574999999999999E-3,34.875393895693932,7.230185320852428E-2,2.7908515338490373E-2,0.11524767640262033,null,null,"25019 (Leven @ Easby)",1,1.5977264285448967,2.1278799363898173,2.7873544075094894,3.0357294724137467,3.9494169661010763,5.1327820806374431,6.6723555457445141,9.4483992159481858,12.303888911659698,null,{"$f":"IFERROR(INDEX('CD3'!B$2:B$100000,(MATCH(H15,'CD3'!A$2:A$100000,0))),\"-\")","v":38.58},"-","-",{"$f":"IF(AU15<=20,\"SPRHOST <=20.\",\"\")","v":""},{"$f":"IF(H15<>\"-\",IFERROR(MATCH(H15,'CD3'!A:A,0),\"Not present in current NRFA dataset\"),\"\")","v":119},{"$f":"IF(AND(ISNUMBER(AY15),AY15<>\"\"),\"\",AY15)","v":""},"","",""]
[null,"45816 (Haddeo @ Upton)",1.4690000000000001,27,3.456,0.29799999999999999,0.41699999999999998,45816,0.29799999999999999,0.41699999999999998,-0.41699999999999998,0.27052606339404084,"",null,null,null,null,null,null,6.8465085798232591E-3,1.0034615384615384E-3,127.3890199493521,6.8831486472478887E-2,2.0511782968798707E-2,7.6381591127596321E-2,null,2.1856634437097754E-2,1.0971999999999999E-2,30.461212205340999,6.31506012523117E-2,2.6333800722213977E-2,0.10874492273328397,null,null,"45816 (Haddeo @ Upton)",1,1.5077203262339451,1.9730373537807975,2.5659483029685042,2.792556412060812,3.6389007385568122,4.7593716259494894,6.2491209437304613,9.0045409996233072,11.909500657789307,null,{"$f":"IFERROR(INDEX('CD3'!B$2:B$100000,(MATCH(H16,'CD3'!A$2:A$100000,0))),\"-\")","v":31.27},"-","-","",{"$f":"IF(H16<>\"-\",IFERROR(MATCH(H16,'CD3'!A:A,0),\"Not present in current NRFA dataset\"),\"\")","v":304},"","","",""]
[null,"49005 (Bolingey Stream @ Bolingey Cocks Bridge)",1.5569999999999999,10,5.9720000000000004,0.25600000000000001,0.13600000000000001,49005,0.25600000000000001,0.13600000000000001,-0.13600000000000001,0.26321966020984511,"",null,null,null,null,null,null,7.014650884750089E-3,2.8988888888888888E-3,100.87214283026258,5.4503751873055284E-2,1.3952960479502154E-2,5.1957907510331879E-2,null,2.1870132101087701E-2,3.4287499999999999E-2,17.80701861146726,3.6916585073659372E-2,5.0206555700176752E-3,2.0732700448038561E-2,null,null,"49005 (Bolingey Stream @ Bolingey Cocks Bridge)",1,1.4015659617000975,1.6740558895030231,1.953177940881035,2.0464274700365834,2.3503988290301909,2.6802064827306014,3.040351295888668,3.5698340887721232,4.0158736472955106,null,{"$f":"IFERROR(INDEX('CD3'!B$2:B$100000,(MATCH(H17,'CD3'!A$2:A$100000,0))),\"-\")","v":31.92},"-","-","",{"$f":"IF(H17<>\"-\",IFERROR(MATCH(H17,'CD3'!A:A,0),\"Not present in current NRFA dataset\"),\"\")","v":335},"","","",""]
[null,"28033 (Dove @ Hollinsclough)",1.653,45,4.1500000000000004,0.22500000000000001,0.373,28033,0.22500000000000001,0.373,-0.373,0.20310437792427768,"",null,null,null,null,null,null,7.1927452370590646E-3,5.9295454545454538E-4,128.44060623117815,6.9399684947990606E-2,1.5614929113297886E-2,5.8146731214569328E-2,null,2.1880114225483867E-2,6.3790697674418603E-3,35.386725966692289,7.3361920270381867E-2,2.7363996260852435E-2,0.11299909536226233,null,null,"28033 (Dove @ Hollinsclough)",1,1.368711423516501,1.6912692116863184,2.0884818401029683,2.2371623592002914,2.7806482443506901,3.4780960906113645,4.3772590312997846,5.9813706912878084,7.6144185955007586,null,{"$f":"IFERROR(INDEX('CD3'!B$2:B$100000,(MATCH(H18,'CD3'!A$2:A$100000,0))),\"-\")","v":42.5},"-","-","",{"$f":"IF(H18<>\"-\",IFERROR(MATCH(H18,'CD3'!A:A,0),\"Not present in current NRFA dataset\"),\"\")","v":182},"","","",""]
[null,"27073 (Brompton Beck @ Snainton Ings)",1.728,40,0.81599999999999995,0.214,0.02,27073,0.19920583508413128,5.4684063365878555E-2,-5.4684063365878555E-2,0.20183879753760028,"SPRHOST <=20.",null,null,null,null,null,null,7.3283104486582739E-3,6.6897435897435894E-4,125.04243928459282,6.7563570011961518E-2,1.3459057385497963E-2,5.0118715654593742E-2,null,2.1885528111876718E-2,7.2184210526315788E-3,34.359598223167623,7.1232532440072868E-2,3.8952843176649444E-3,1.608550154293999E-2,null,null,"27073 (Brompton Beck @ Snainton Ings)",1,1.2906870192626116,1.47122816303568,1.6448221774504967,1.7005676437153325,1.8753668810645925,2.0544067996221305,2.2390875200887463,2.4932638502625464,2.6938352440963218,null,{"$f":"IFERROR(INDEX('CD3'!B$2:B$100000,(MATCH(H19,'CD3'!A$2:A$100000,0))),\"-\")","v":17.77},40,38,"SPRHOST <=20.",{"$f":"IF(H19<>\"-\",IFERROR(MATCH(H19,'CD3'!A:A,0),\"Not present in current NRFA dataset\"),\"\")","v":156},"","","",""]
[null,"27010 (Hodge Beck @ Bransdale Weir)",1.734,41,9.42,0.224,0.29299999999999998,27010,0.224,0.29299999999999998,-0.29299999999999998,0.2160359280223707,"",null,null,null,null,null,null,7.339027387239452E-3,6.5224999999999994E-4,125.13643958809509,6.7614360736479986E-2,1.5145616804971517E-2,5.6399110303200425E-2,null,2.1885891403553182E-2,7.0333333333333333E-3,34.57907357815504,7.1687537333971665E-2,2.1004448438853698E-2,8.6737465154872559E-2,null,null,"27010 (Hodge Beck @ Bransdale Weir)",1,1.3694576376932734,1.6663020572006813,2.0098379819872028,2.1336177202457867,2.568816784809564,3.0965430825190117,3.739817109241149,4.8146714957327532,5.8413508764350448,null,{"$f":"IFERROR(INDEX('CD3'!B$2:B$100000,(MATCH(H20,'CD3'!A$2:A$100000,0))),\"-\")","v":50.58},"-","-","",{"$f":"IF(H20<>\"-\",IFERROR(MATCH(H20,'CD3'!A:A,0),\"Not present in current NRFA dataset\"),\"\")","v":133},"","","",""]
[null,"44008 (South Winterbourne @ Winterbourne Steepleton)",1.8,41,0.44800000000000001,0.40699999999999997,0.31900000000000001,44008,0.39894382249244259,0.30348785304113007,-0.30348785304113007,0.42137853997360564,"SPRHOST <=20. Non-Flood Yrs over 15% of record, consider removing station.",null,null,null,null,null,null,7.455711696549407E-3,6.5224999999999994E-4,123.33556045603679,6.6641300517741156E-2,2.6586135164415249E-2,9.9001208665299462E-2,null,2.1889333336985544E-2,7.0333333333333333E-3,34.574958505683838,7.1679006179695817E-2,2.1753707693597777E-2,8.9831516812049844E-2,null,null,"44008 (South Winterbourne @ Winterbourne Steepleton)",1,1.7262483816395648,2.316328289557374,3.0048084199471981,3.2541217991271401,4.1351564802994023,5.2114713719289263,6.5331247528443335,8.7605096600357513,10.905937543216274,null,{"$f":"IFERROR(INDEX('CD3'!B$2:B$100000,(MATCH(H21,'CD3'!A$2:A$100000,0))),\"-\")","v":19.53},41,34,"SPRHOST <=20.",{"$f":"IF(H21<>\"-\",IFERROR(MATCH(H21,'CD3'!A:A,0),\"Not present in current NRFA dataset\"),\"\")","v":294},"","",""," Non-Flood Yrs over 15% of record, consider removing station."]
[null,"47022 (Tory Brook @ Newnham Park)",1.8129999999999999,26,5.88,0.25700000000000001,0.19500000000000001,47022,0.25700000000000001,0.19500000000000001,-0.19500000000000001,0.26245749673433844,"",null,null,null,null,null,null,7.4784413562898723E-3,1.0436E-3,117.34277718118898,6.3403249223530841E-2,1.6294635050447426E-2,6.0677814010118056E-2,null,2.1889905017421839E-2,1.1429166666666666E-2,30.01284097832621,6.2221061338425546E-2,1.2133106960992983E-2,5.010343143801705E-2,null,null,"47022 (Tory Brook @ Newnham Park)",1,1.4177696193821363,1.7199277988782704,2.043972890329453,2.1553628520333872,2.5288970206505521,2.9514762695491674,3.4324013771457458,4.1742258838879938,4.8294131115525287,null,{"$f":"IFERROR(INDEX('CD3'!B$2:B$100000,(MATCH(H22,'CD3'!A$2:A$100000,0))),\"-\")","v":44.18},"-","-","",{"$f":"IF(H22<>\"-\",IFERROR(MATCH(H22,'CD3'!A:A,0),\"Not present in current NRFA dataset\"),\"\")","v":321},"","","",""]
[null,"36010 (Bumpstead Brook @ Broad Green)",1.88,53,7.5,0.377,0.17299999999999999,36010,0.377,0.17299999999999999,-0.17299999999999999,0.40111413258134276,"",null,null,null,null,null,null,7.5943153243769818E-3,5.0173076923076918E-4,123.51708333152303,6.673938188576993E-2,2.5160746970935264E-2,9.3693361056044658E-2,null,2.1892400061000416E-2,5.3784313725490198E-3,36.669215694310239,7.602071128805471E-2,1.3151583052833463E-2,5.4309208837230942E-2,null,null,"36010 (Bumpstead Brook @ Broad Green)",{"$f":"IFERROR(1+(($L23/$K23)*(1-((AJ$11-1)^(-1*$K23)))),\"-\")","v":1},1.6284083292364067,2.0722496219191382,2.5401675670107364,2.6993145565126451,3.2273830052504811,3.8155498783197643,4.4746868417751031,5.4733520416098873,6.3399736353456824,null,{"$f":"IFERROR(INDEX('CD3'!B$2:B$100000,(MATCH(H23,'CD3'!A$2:A$100000,0))),\"-\")","v":44.57},"-","-","",{"$f":"IF(H23<>\"-\",IFERROR(MATCH(H23,'CD3'!A:A,0),\"Not present in current NRFA dataset\"),\"\")","v":226},"","","",""]
[null,"25011 (Langdon Beck @ Langdon)",1.907,34,15.878,0.22800000000000001,0.316,25011,0.22800000000000001,0.316,-0.316,0.21681049459736215,"",null,null,null,null,null,null,7.6404260260787196E-3,7.9060606060606055E-4,118.60944066140024,6.4087659310350001E-2,1.46119863227598E-2,5.4411981960066219E-2,null,2.1893221651818458E-2,8.5718749999999996E-3,32.824448628174963,6.8049940122915153E-2,2.150378107884119E-2,8.8799449671518552E-2,null,null,"25011 (Langdon Beck @ Langdon)",1,1.3771623438878253,1.6877235439399763,2.0536108369255182,2.186900295838675,2.660794049146165,3.2448781561098312,3.9684145989453694,5.2003355596213066,6.3988253974878013,null,{"$f":"IFERROR(INDEX('CD3'!B$2:B$100000,(MATCH(H24,'CD3'!A$2:A$100000,0))),\"-\")","v":58.21},"-","-","",{"$f":"IF(H24<>\"-\",IFERROR(MATCH(H24,'CD3'!A:A,0),\"Not present in current NRFA dataset\"),\"\")","v":116},"","","",""]
[null,"26014 (Water Forlornes @ Driffield)",2.1909999999999998,22,0.43099999999999999,0.29799999999999999,0.12,26014,0.28684118108232515,9.9291277620140658E-2,-9.9291277620140658E-2,0.2960126635519974,"SPRHOST <=20.",null,null,null,null,null,null,8.106952637469942E-3,1.2423809523809523E-3,106.95949506877615,5.7792901153150611E-2,1.6577384024943791E-2,6.173071207337176E-2,null,2.1897965309720064E-2,1.3715E-2,28.079661193701941,5.8213293528501311E-2,5.7800722889211611E-3,2.3868697157767613E-2,null,null,"26014 (Water Forlornes @ Driffield)",1,1.4399448090954565,1.726807928463761,2.0123786274249706,2.1060973765117605,2.4062828342352809,2.7236224695120725,3.0613530313401744,3.543296239352125,3.9374929736382205,null,{"$f":"IFERROR(INDEX('CD3'!B$2:B$100000,(MATCH(H25,'CD3'!A$2:A$100000,0))),\"-\")","v":6.51},22,19,"SPRHOST <=20.",{"$f":"IF(H25<>\"-\",IFERROR(MATCH(H25,'CD3'!A:A,0),\"Not present in current NRFA dataset\"),\"\")","v":125},"","","",""]
[null,"72014 (Conder @ Galgate)",2.1930000000000001,52,16.779,0.23,0.14899999999999999,72014,0.23,0.14899999999999999,-0.14899999999999999,0.23478304887224632,"",null,null,null,null,null,null,8.1101271540109099E-3,5.1156862745098039E-4,115.98646314454399,6.2670398689765205E-2,1.4414191698645999E-2,5.367543613519677E-2,null,2.1897982479999845E-2,5.4859999999999996E-3,36.517697918130047,7.5706592512948492E-2,1.1280282284429325E-2,4.6581708366735454E-2,null,null,"72014 (Conder @ Galgate)",1,1.3615325958645976,1.6103374865686062,1.8677884151008413,1.9543413884749707,2.2382462812855537,2.5491315930165825,2.8917198150845107,3.4007424646606816,3.8340426949478341,null,{"$f":"IFERROR(INDEX('CD3'!B$2:B$100000,(MATCH(H26,'CD3'!A$2:A$100000,0))),\"-\")","v":35.96},"-","-","",{"$f":"IF(H26<>\"-\",IFERROR(MATCH(H26,'CD3'!A:A,0),\"Not present in current NRFA dataset\"),\"\")","v":454},"","","",""]
[null,"73015 (Keer @ High Keer Weir)",2.218,29,12.420999999999999,0.20200000000000001,0.23799999999999999,73015,0.20200000000000001,0.23799999999999999,-0.23799999999999999,0.19900095400491744,"",null,null,null,null,null,null,8.1496871358654327E-3,9.3178571428571421E-4,110.11429715207005,5.9497519942163415E-2,1.201849902831701E-2,4.4754377527527374E-2,null,2.1898185269755486E-2,1.0159259259259259E-2,31.194002350839721,6.4669783679066853E-2,1.539140851561791E-2,6.3558524933143845E-2,null,null,"73015 (Keer @ High Keer Weir)",1,1.326831450729457,1.5744096972929973,1.8489455510794612,1.9452903693512913,2.275136845175906,2.6598316330505121,3.1110318485634409,3.8318345466616881,4.490740907526293,null,{"$f":"IFERROR(INDEX('CD3'!B$2:B$100000,(MATCH(H27,'CD3'!A$2:A$100000,0))),\"-\")","v":35.79},"-","-","",{"$f":"IF(H27<>\"-\",IFERROR(MATCH(H27,'CD3'!A:A,0),\"Not present in current NRFA dataset\"),\"\")","v":463},"","","",""]
[null,null,null,null,null,null,null,"-","-","-","-","-","",null,null,null,null,null,null,"-","-","-","-","-","-",null,"-","-","-","-","-","-",null,null,"-","-","-","-","-","-","-","-","-","-","-",null,{"$f":"IFERROR(INDEX('CD3'!B$2:B$100000,(MATCH(H28,'CD3'!A$2:A$100000,0))),\"-\")","v":"-"},"-","-","",{"$f":"IF(H28<>\"-\",IFERROR(MATCH(H28,'CD3'!A:A,0),\"Not present in current NRFA dataset\"),\"\")","v":""},"","","",""]
[null,null,null,null,null,null,null,"-","-","-","-","-","",null,null,null,null,null,null,"-","-",{"$f":"IFERROR((U29+T29)^-1,\"-\")","v":"-"},"-","-","-",null,"-","-",{"$f":"IFERROR((AB29+AA29)^-1,\"-\")","v":"-"},"-","-","-",null,null,"-","-","-","-","-","-","-","-","-","-","-",null,{"$f":"IFERROR(INDEX('CD3'!B$2:B$100000,(MATCH(H29,'CD3'!A$2:A$100000,0))),\"-\")","v":"-"},"-","-","",{"$f":"IF(H29<>\"-\",IFERROR(MATCH(H29,'CD3'!A:A,0),\"Not present in current NRFA dataset\"),\"\")","v":""},"","","",""]
[null,null,null,null,null,null,null,"-","-","-","-","-","",null,null,null,null,null,null,"-","-",{"$f":"IFERROR((U30+T30)^-1,\"-\")","v":"-"},"-","-","-",null,"-","-",{"$f":"IFERROR((AB30+AA30)^-1,\"-\")","v":"-"},"-","-","-",null,null,"-","-","-","-","-","-","-","-","-","-","-",null,{"$f":"IFERROR(INDEX('CD3'!B$2:B$100000,(MATCH(H30,'CD3'!A$2:A$100000,0))),\"-\")","v":"-"},"-","-","",{"$f":"IF(H30<>\"-\",IFERROR(MATCH(H30,'CD3'!A:A,0),\"Not present in current NRFA dataset\"),\"\")","v":""},"","","",""]
[null,null,null,null,null,null,null,"-","-","-","-","-","",null,null,null,null,null,null,"-","-","-","-","-","-",null,"-","-","-","-","-","-",null,null,"-","-","-","-","-","-","-","-","-","-","-",null,{"$f":"IFERROR(INDEX('CD3'!B$2:B$100000,(MATCH(H31,'CD3'!A$2:A$100000,0))),\"-\")","v":"-"},"-","-","",{"$f":"IF(H31<>\"-\",IFERROR(MATCH(H31,'CD3'!A:A,0),\"Not present in current NRFA dataset\"),\"\")","v":""},"","","",""]
[null,null,null,null,null,null,null,"-","-","-","-","-","",null,null,null,null,null,null,"-","-","-","-","-","-",null,"-","-","-","-","-","-",null,null,"-","-","-","-","-","-","-","-","-","-","-",null,{"$f":"IFERROR(INDEX('CD3'!B$2:B$100000,(MATCH(H32,'CD3'!A$2:A$100000,0))),\"-\")","v":"-"},"-","-","",{"$f":"IF(H32<>\"-\",IFERROR(MATCH(H32,'CD3'!A:A,0),\"Not present in current NRFA dataset\"),\"\")","v":""},"","","",""]
[null,null,null,null,null,null,null,"-","-","-","-","-","",null,null,null,null,null,null,"-","-","-","-","-","-",null,"-","-","-","-","-","-",null,null,"-","-","-","-","-","-","-","-","-","-","-",null,{"$f":"IFERROR(INDEX('CD3'!B$2:B$100000,(MATCH(H33,'CD3'!A$2:A$100000,0))),\"-\")","v":"-"},"-","-","",{"$f":"IF(H33<>\"-\",IFERROR(MATCH(H33,'CD3'!A:A,0),\"Not present in current NRFA dataset\"),\"\")","v":""},"","","",""]
[]
[]
[null,"URBAN",{"$f":"IF(C37=\"\",\"\",1.567*C37)","v":1.6453499999999999E-2},null,null,null,null,null,null,null,null,null,null,null,null,null,null,null,null,null,"sum(bj+cj)",{"$f":"SUM(V13:V30)","v":1850.7375981235923},null,null,null,null,null,"sum(bj+cj)",{"$f":"SUM(AC13:AC30)","v":482.35822939573245}]
[null,"URBEXT2000",1.0500000000000001E-2,null,null,null,null,null,null,null,null,null,null,null,null,null,null,null,null,null,null,null,"sum(t2*wj)",{"$f":"SUM(X13:X30)","v":0.26854354126419727},"L-CV Pooled",null,null,null,null,"sum(t3*wj)",{"$f":"SUM(AE13:AE30)","v":0.24216119760186183},"L-SKEW Pooled"]
[]
[]
[null,null,null,null,null,null,null,null,null,null,null,null,null,null,null,null,null,null,null,"Calculation of GLO Fitting parmeters from Pooled L-CV and Pooled L-SKEW (FEH Vol3 Pg 142)"]
[null,"SPECIFY TARGET RETURN PERIODS",2,5,10,20,25,50,100,200,500,1000,null,null,null,null,null,null,null,null,null,null,null,"L-CV Pooled","L-SKEW Pooled","k (Shape)","Beta (Scale)"]
[null,null,{"$f":"1+(($AA42/$Z42)*(1-((AJ$11-1)^(-1*$Z42))))","v":1},1.4446416664972006,1.7836516591772289,2.1613423383389012,{"$f":"1+(($AA42/$Z42)*(1-((AN$11-1)^(-1*$Z42))))","v":2.2942728607326677},2.7507026222797304,3.2853101937764828,3.9149972658531773,4.9259035015165331,5.854472037172572,null,null,null,null,null,null,null,"Final Pooled Growth Curve",null,null,null,{"$f":"X44*(0.68654^C36)","v":0.26688692207449805},{"$f":"(Y44+1)*(1.096017^C36)-1","v":0.24403641340271864},{"$f":"-1*Y42","v":-0.24403641340271864},{"$f":"(Z42*X42*SIN(PI()*Z42))/(Z42*PI()*(X42+Z42)-X42*SIN(PI()*Z42))","v":0.26954006513225937}]
[]
[null,null,null,null,null,null,null,null,null,null,null,null,null,null,null,null,null,null,null,null,null,null,"put in values from previous",{"$f":"X37","v":0.26854354126419727},{"$f":"AE37","v":0.24216119760186183},{"$f":"-1*Y44","v":-0.24216119760186183},{"$f":"(Z44*F25*SIN(PI()*Z44))/(Z44*PI()*(X44+Z44)-F25*SIN(PI()*Z44))","v":0.26837777368398941},"permeability changes. "]

{"sheet":"Guidance","index":1,"n_rows":0,"n_cols":0,"rows_kept":0,"cut":false,"hidden":false,"merged":[]}

{"sheet":"CD3","index":2,"n_rows":547,"n_cols":22,"rows_kept":547,"cut":false,"hidden":true,"merged":[]}
["Station Number","SPRHOST","QMED","QMED_adj","Number years in record","Number flood years > Qmed/2","w(total yrs/flood yrs)","L-CV","L-Skew","L-CV(>Qmed/2)","L-Skew(>Qmed/2)","k(Shape)","Beta(Scale)","k","LHS","RHS","diff","A","B","Beta","L-CVAdj","L-SKEWadj"]
[2001,52.88]
[2002,54.16]
[3002,49.93]
[3003,53.57]
[4006,52.93]
[6012,46.36]
[7001,55.84]
[7002,51.62]
[7003,34.65]
[7004,41.25]
[7005,50.31]
[7010,34.119999999999997]
[7011,27.08]
[8004,43.44]
[8005,47.64]
[8006,43.98]
[8008,53.49]
[8009,46.63]
[8010,46.42]
[8011,41.99]
[8013,49.14]
[9001,37.32]
[9003,36.31]
[9004,32.61]
[9006,33]
[9010,42.57]
[10001,28.31]
[10002,33]
[10003,27.83]
[11001,31.28]
[11002,32.44]
[11003,33.590000000000003]
[12001,40.270000000000003]
[12002,39.69]
[12003,44.94]
[12005,43]
[12006,42.66]
[12007,50.1]
[12008,44.79]
[13001,40.159999999999997]
[14001,29.71]
[15003,45.36]
[15006,42.87]
[15007,44.6]
[15008,37.21]
[15011,47.57]
[15013,42.65]
[15016,44.79]
[15023,39.880000000000003]
[16001,41.12]
[16004,39.909999999999997]
[17001,44.19]
[17004,41.73]
[18003,41.58]
[18014,39.35]
[19001,44.41]
[19005,46.03]
[19006,42.88]
[19007,34.090000000000003]
[19008,31.01]
[19021,32.4]
[20001,35.369999999999997]
[20003,33.89]
[20005,32.42]
[20006,34.06]
[20007,32.770000000000003]
[21003,37.159999999999997]
[21006,38.340000000000003]
[21007,41.68]
[21008,42.86]
[21012,43.58]
[21013,34.69]
[21016,30.2]
[21017,43.7]
[21020,46.25]
[21021,38.700000000000003]
[21024,43.99]
[21025,46.62]
[21027,36.770000000000003]
{"$rows_left_out":468}
{"sheet":"AM","index":3,"n_rows":51709,"n_cols":5,"rows_kept":51709,"cut":false,"hidden":true,"merged":[]}
["Station Number","Water Year","Date","Flow","Stage"]
[]
[]
[]
[]
[]
[]
[]
[]
[]
[]
[]
[]
[]
[]
[]
[]
[]
[]
[]
[]
[]
[]
[]
[]
[]
[]
[]
[]
[]
[]
[]
[]
[]
[]
[]
[]
[]
[]
[]
[]
[]
[]
[]
[]
[]
[]
[]
[]
[]
[]
[]
[]
[]
[]
[]
[]
[]
[]
[]
[]
[]
[]
[]
[]
[]
[]
[]
[]
[]
[]
[]
[]
[]
[]
[]
[]
[]
[]
[]
{"$rows_left_out":51629}